Target
Histamine H3 receptor
Ligand
BDBM50198598
Substrate
Meas. Tech.
ChEMBL_440971 (CHEMBL890061)
Ki
47±n/a nM
Citation
 Keith, JMGomez, LALetavic, MALy, KSJablonowski, JASeierstad, MBarbier, AJWilson, SJBoggs, JDFraser, ICMazur, CLovenberg, TWCarruthers, NI Dual serotonin transporter/histamine H3 ligands: Optimization of the H3 pharmacophore. Bioorg Med Chem Lett 17:702-6 (2007)  
Target
Name:
Histamine H3 receptor
Synonyms:
G-protein coupled receptor 97 HH3R HRH3 Histamine H3 receptor (H3) Histamine receptor (H3 and H4)
Type:
G Protein-Coupled Receptor (GPCR)
Mol. Mass.:
48691.47
Organism:
Homo sapiens (Human)
Description:
Binding assays were using CHO cells stably expressing hH3R receptors.
Residue:
445
  
Inhibitor
Name:
BDBM50198598
Synonyms:
CHEMBL396945 | N-ethyl-3-(4-(4-methoxyphenyl)-2-methyl-1,2,3,4-tetrahydroisoquinolin-7-yloxy)propan-1-amine
Type:
Small organic molecule
Emp. Form.:
C22H30N2O2
Mol. Mass.:
354.4858
SMILES:
CCNCCCOc1ccc2C(CN(C)Cc2c1)c1ccc(OC)cc1
: