Target
Interstitial collagenase
Ligand
BDBM50203524
Substrate
Meas. Tech.
ChEMBL_425538 (CHEMBL911375)
IC50
>5000±n/a nM
Citation
 Yao, WZhuo, JBurns, DMXu, MZhang, CLi, YLQian, DQHe, CWeng, LShi, ELin, QAgrios, CBurn, TCCaulder, ECovington, MBFridman, JSFriedman, SKatiyar, KHollis, GLi, YLiu, CLiu, XMarando, CANewton, RPan, MScherle, PTaylor, NVaddi, KWasserman, ZRWynn, RYeleswaram, SJalluri, RBower, MZhou, BBMetcalf, B Discovery of a potent, selective, and orally active human epidermal growth factor receptor-2 sheddase inhibitor for the treatment of cancer. J Med Chem 50:603-6 (2007)  
Target
Name:
Interstitial collagenase
Synonyms:
CLG MMP1 Matrix metalloproteinase-1 | Matrix metalloproteinase-1 (MMP-1)
Type:
Enzyme
Mol. Mass.:
54010.26
Organism:
Homo sapiens (Human)
Description:
P03956
Residue:
469
  
Inhibitor
Name:
BDBM50203524
Synonyms:
(6S,7S)-N-hydroxy-6-{[4-(2-methylphenyl)piperazin-1-yl]carbonyl}-5-azaspiro[2.5]octane-7-carboxamide | CHEMBL220501
Type:
Small organic molecule
Emp. Form.:
C20H28N4O3
Mol. Mass.:
372.4613
SMILES:
Cc1ccccc1N1CCN(CC1)C(=O)[C@H]1NCC2(CC2)C[C@@H]1C(=O)NO
: