Target
Interstitial collagenase
Ligand
BDBM50203532
Substrate
Meas. Tech.
ChEMBL_425538 (CHEMBL911375)
IC50
>5000±n/a nM
Citation
 Yao, WZhuo, JBurns, DMXu, MZhang, CLi, YLQian, DQHe, CWeng, LShi, ELin, QAgrios, CBurn, TCCaulder, ECovington, MBFridman, JSFriedman, SKatiyar, KHollis, GLi, YLiu, CLiu, XMarando, CANewton, RPan, MScherle, PTaylor, NVaddi, KWasserman, ZRWynn, RYeleswaram, SJalluri, RBower, MZhou, BBMetcalf, B Discovery of a potent, selective, and orally active human epidermal growth factor receptor-2 sheddase inhibitor for the treatment of cancer. J Med Chem 50:603-6 (2007)  
Target
Name:
Interstitial collagenase
Synonyms:
CLG MMP1 Matrix metalloproteinase-1 | Matrix metalloproteinase-1 (MMP-1)
Type:
Enzyme
Mol. Mass.:
54010.26
Organism:
Homo sapiens (Human)
Description:
P03956
Residue:
469
  
Inhibitor
Name:
BDBM50203532
Synonyms:
(6S,7S)-5-methyl-5-aza-spiro[2.5]octane-6,7-dicarboxylic acid 6-sec-butylamide 7-hydroxyamide | CHEMBL220975
Type:
Small organic molecule
Emp. Form.:
C14H25N3O3
Mol. Mass.:
283.3666
SMILES:
CCC(C)NC(=O)[C@@H]1[C@H](CC2(CC2)CN1C)C(=O)NO
: