Target
C-C chemokine receptor type 8
Ligand
BDBM50203857
Substrate
Meas. Tech.
ChEMBL_425772 (CHEMBL855762)
Ki
2.3±n/a nM
Citation
 Jenkins, TJGuan, BDai, MLi, GLightburn, TEHuang, SFreeze, BSBurdi, DFJacutin-Porte, SBennett, RChen, WMinor, CGhosh, SBlackburn, CGigstad, KMJones, MKolbeck, RYin, WSmith, SCardillo, DOcain, TDHarriman, GC Design, synthesis, and evaluation of naphthalene-sulfonamide antagonists of human CCR8. J Med Chem 50:566-84 (2007)  
Target
Name:
C-C chemokine receptor type 8
Synonyms:
CCR8 CKRL1 CMKBRL2
Type:
PROTEIN
Mol. Mass.:
40855.53
Organism:
Homo sapiens (Human)
Description:
ChEMBL_454278
Residue:
355
  
Inhibitor
Name:
BDBM50203857
Synonyms:
CHEMBL218037 | ethyl 4-({[5-(benzoylamino)-1-naphthyl]sulfonyl}amino)-piperidine-1-carboxylate
Type:
Small organic molecule
Emp. Form.:
C25H27N3O5S
Mol. Mass.:
481.564
SMILES:
CCOC(=O)N1CCC(CC1)NS(=O)(=O)c1cccc2c(NC(=O)c3ccccc3)cccc12
: