Target
Potassium voltage-gated channel subfamily H member 2
Ligand
BDBM50205457
Substrate
Meas. Tech.
ChEMBL_438371 (CHEMBL886338)
Ki
72000±n/a nM
Citation
 Murphy, STCase, HLEllsworth, EHagen, SHuband, MJoannides, TLimberakis, CMarotti, KROttolini, AMRauckhorst, MStarr, JStier, MTaylor, CZhu, TBlaser, ADenny, WALu, GLSmaill, JBRivault, F The synthesis and biological evaluation of novel series of nitrile-containing fluoroquinolones as antibacterial agents. Bioorg Med Chem Lett 17:2150-5 (2007)  
Target
Name:
Potassium voltage-gated channel subfamily H member 2
Synonyms:
1,3-beta-glucan synthase component GLS2 ERG Eag-related protein 1 Ether-a-go-go-related gene (HERG) Ether-a-go-go-related gene potassium channel 1 Ether-a-go-go-related gene potassium channel 1 (hERG1) Ether-a-go-go-related protein 1 H-ERG KCNH2 Potassium voltage-gated channel subfamily H member 2 (hERG) Voltage-gated potassium channel subunit Kv11.1 hERG Potassium Channel 1 | putative potassium channel subunit
Type:
Multi-pass membrane protein
Mol. Mass.:
126672.65
Organism:
Homo sapiens (Human)
Description:
Q12809
Residue:
1159
  
Inhibitor
Name:
BDBM50205457
Synonyms:
7-((R)-3-((S)-1-(2-cyanoethylamino)ethyl)pyrrolidin-1-yl)-1-cyclopropyl-6-fluoro-8-methyl-4-oxo-1,4-dihydroquinoline-3-carboxylic acid | CHEMBL230813
Type:
Small organic molecule
Emp. Form.:
C23H27FN4O3
Mol. Mass.:
426.4839
SMILES:
C[C@H](NCCC#N)[C@@H]1CCN(C1)c1c(F)cc2c(c1C)n(cc(C(O)=O)c2=O)C1CC1
: