Target
Mitogen-activated protein kinase 8
Ligand
BDBM50211431
Substrate
Meas. Tech.
ChEMBL_455590 (CHEMBL886370)
IC50
92±n/a nM
Citation
 Alam, MBeevers, RECeska, TDavenport, RJDickson, KMFortunato, MGowers, LHaughan, AFJames, LAJones, MWKinsella, NLowe, CMeissner, JWNicolas, ALPerry, BGPhillips, DJPitt, WRPlatt, ARatcliffe, AJSharpe, ATait, LJ Synthesis and SAR of aminopyrimidines as novel c-Jun N-terminal kinase (JNK) inhibitors. Bioorg Med Chem Lett 17:3463-7 (2007)  
Target
Name:
Mitogen-activated protein kinase 8
Synonyms:
JNK-46 JNK1-alpha-1 MK08_HUMAN PRKM8 SAPK1C c-Jun N-terminal kinase 1 c-Jun N-terminal kinase 1(JNK1) | c-Jun N-terminal kinase 2 (JNK2)
Type:
Enzyme
Mol. Mass.:
48297.57
Organism:
Homo sapiens (Human)
Description:
JNK-1 was purchased from Upstate Cell Signaling Solutions (formerly Upstate Biotechnology).
Residue:
427
  
Inhibitor
Name:
BDBM50211431
Synonyms:
4-(5-cyano-4-(6-fluoro-1H-indol-3-yl)pyrimidin-2-ylamino)-N-ethylpiperidine-1-carboxamide | CHEMBL248370
Type:
Small organic molecule
Emp. Form.:
C21H22FN7O
Mol. Mass.:
407.4441
SMILES:
CCNC(=O)N1CCC(CC1)Nc1ncc(C#N)c(n1)-c1c[nH]c2cc(F)ccc12
: