Target
Adenosine receptor A3
Ligand
BDBM50218928
Substrate
Meas. Tech.
ChEMBL_445192 (CHEMBL894340)
Ki
85.5±n/a nM
Citation
 Colotta, VCatarzi, DVarano, FCapelli, FLenzi, OFilacchioni, GMartini, CTrincavelli, LCiampi, OPugliese, AMPedata, FSchiesaro, AMorizzo, EMoro, S New 2-arylpyrazolo[3,4-c]quinoline derivatives as potent and selective human A3 adenosine receptor antagonists. Synthesis, pharmacological evaluation, and ligand-receptor modeling studies. J Med Chem 50:4061-74 (2007)  
Target
Name:
Adenosine receptor A3
Synonyms:
A3 adenosine receptor (hA3) ADORA3 | Adenosine A3 receptor (A3AR)
Type:
G Protein-Coupled Receptor (GPCR)
Mol. Mass.:
36197.32
Organism:
Homo sapiens (Human)
Description:
P0DMS8
Residue:
318
  
Inhibitor
Name:
BDBM50218928
Synonyms:
2-(4-nitrophenyl)-2H-pyrazolo[3,4-c]quinolin-4(5H)-one | CHEMBL242204
Type:
Small organic molecule
Emp. Form.:
C16H10N4O3
Mol. Mass.:
306.2756
SMILES:
[O-][N+](=O)c1ccc(cc1)-n1cc2c(n1)c(=O)[nH]c1ccccc21
: