Target
5-hydroxytryptamine receptor 1A
Ligand
BDBM50220922
Substrate
Meas. Tech.
ChEMBL_449379 (CHEMBL899645)
Ki
24±n/a nM
Citation
 Krushinski, JHSchaus, JMThompson, DCCalligaro, DONelson, DLLuecke, SHWainscott, DBWong, DT Indoloxypropanolamine analogues as 5-HT(1A) receptor antagonists. Bioorg Med Chem Lett 17:5600-4 (2007)  
Target
Name:
5-hydroxytryptamine receptor 1A
Synonyms:
5-HT-1A 5-hydroxytryptamine receptor 1A (5-HT-1A) ADRB2RL1 Dopamine D2 receptor and serotonin 1a receptor HTR1A | Serotonin receptor 1A
Type:
Mol. Mass.:
46122.49
Organism:
Homo sapiens (Human)
Description:
Residue:
422
  
Inhibitor
Name:
BDBM50220922
Synonyms:
(S)-1-(adamantan-2-ylamino)-3-(1H-indol-4-yloxy)-propan-2-ol | CHEMBL236515
Type:
Small organic molecule
Emp. Form.:
C21H28N2O2
Mol. Mass.:
340.4592
SMILES:
O[C@@H](CNC1C2CC3CC(C2)CC1C3)COc1cccc2[nH]ccc12
: