Target
Epidermal growth factor receptor
Ligand
BDBM50222489
Substrate
Meas. Tech.
ChEMBL_457884 (CHEMBL924156)
IC50
2±n/a nM
Citation
 Ballard, PBarlaam, BCBradbury, RHDishington, AHennequin, LFHickinson, DMHollingsworth, IMKettle, JGKlinowska, TOgilvie, DJPearson, SEScott, JSSuleman, AWhittaker, RWilliams, EJWood, RWright, L Neutral 5-substituted 4-anilinoquinazolines as potent, orally active inhibitors of erbB2 receptor tyrosine kinase. Bioorg Med Chem Lett 17:6326-9 (2007)  
Target
Name:
Epidermal growth factor receptor
Synonyms:
EGF Receptor Substrate EGFR_HUMAN ERBB1 Epidermal Growth Factor Receptor erbB-1 Epidermal growth factor receptor (EGFR) HER1 Proto-oncogene c-ErbB-1 Tyrosine-Protein Kinase ErbB-1
Type:
Receptor Kinase Domain
Mol. Mass.:
134279.59
Organism:
Homo sapiens (Human)
Description:
P00533
Residue:
1210
  
Inhibitor
Name:
BDBM50222489
Synonyms:
(R)-N-(2-(4-(3-chloro-4-(pyridin-2-ylmethoxy)phenylamino)quinazolin-5-yloxy)propyl)-2-hydroxy-N-methylacetamide | CHEMBL250132
Type:
Small organic molecule
Emp. Form.:
C26H26ClN5O4
Mol. Mass.:
507.969
SMILES:
C[C@H](CN(C)C(=O)CO)Oc1cccc2ncnc(Nc3ccc(OCc4ccccn4)c(Cl)c3)c12
: