Target
Vascular endothelial growth factor receptor 2
Ligand
BDBM15019
Substrate
Meas. Tech.
ChEMBL_457937 (CHEMBL925259)
Ki
10±n/a nM
Citation
 Dominguez, CSmith, LHuang, QYuan, COuyang, XCai, LChen, PKim, JHarvey, TSyed, RKim, TSTasker, AWang, LZhang, MCoxon, ABready, JStarnes, CChen, DGan, YNeervannan, SKumar, GPolverino, AKendall, R Discovery of N-phenyl nicotinamides as potent inhibitors of Kdr. Bioorg Med Chem Lett 17:6003-8 (2007)  
Target
Name:
Vascular endothelial growth factor receptor 2
Synonyms:
CD_antigen=CD309 Fetal liver kinase 1 (FLK-1) KDR Protein-tyrosine kinase receptor Flk-1 VEGFR-2 VEGFR2 Vascular Endothelial Growth Factor Receptor Kinase 2 Vascular endothelial growth factor receptor 2 (KDR) Vascular endothelial growth factor receptor 2 (VEGFR2) Vascular endothelial growth factor receptor-2 (VEGFR-2)
Type:
Receptor Tyrosine Kinase
Mol. Mass.:
151510.97
Organism:
Homo sapiens (Human)
Description:
P35968
Residue:
1356
  
Inhibitor
Name:
BDBM15019
Synonyms:
CHEMBL385178 nicotinamide 35
Type:
Small Organic Molecule
Emp. Form.:
C24H20N4O2
Mol. Mass.:
396.4412
SMILES:
O=C(Nc1ccc(Oc2ccccc2)cc1)c1cccnc1NCc1ccncc1
: