Target
Calcitonin gene-related peptide type 1 receptor
Ligand
BDBM50224430
Substrate
Meas. Tech.
ChEMBL_450785 (CHEMBL899870)
Ki
0.5±n/a nM
Citation
 Paone, DVShaw, AWNguyen, DNBurgey, CSDeng, JZKane, SAKoblan, KSSalvatore, CAMosser, SDJohnston, VKWong, BKMiller-Stein, CMHershey, JCGraham, SLVacca, JPWilliams, TM Potent, orally bioavailable calcitonin gene-related peptide receptor antagonists for the treatment of migraine: discovery of N-[(3R,6S)-6-(2,3-difluorophenyl)-2-oxo-1- (2,2,2-trifluoroethyl)azepan-3-yl]-4- (2-oxo-2,3-dihydro-1H-imidazo[4,5-b]pyridin- 1-yl)piperidine-1-carboxamide (MK-0974). J Med Chem 50:5564-7 (2007)  
Target
Name:
Calcitonin gene-related peptide type 1 receptor
Synonyms:
Adrenomedullin receptor AM1; CALCRL/RAMP2 CALRL_HUMAN CGRP type 1 receptor mRNA Calcitonin gene-related peptide (CGRP) receptor Calcitonin receptor-like receptor Human CL receptor
Type:
Enzyme Catalytic Domain
Mol. Mass.:
52980.45
Organism:
Homo sapiens (Human)
Description:
Q16602
Residue:
461
  
Inhibitor
Name:
BDBM50224430
Synonyms:
CHEMBL392636 | N-{(3R,6S)-6-(2,3-difluorophenyl)-1-[2-(methylsulfonyl)ethyl]-2-oxoazepan-3-yl}-4-(2-oxo-2,3-dihydro-1H-imidazo[4,5-b]pyridin-1-yl)piperidine-1-carboxamide
Type:
Small organic molecule
Emp. Form.:
C27H32F2N6O5S
Mol. Mass.:
590.642
SMILES:
CS(=O)(=O)CCN1C[C@@H](CC[C@@H](NC(=O)N2CCC(CC2)n2c3cccnc3[nH]c2=O)C1=O)c1cccc(F)c1F
: