Target
Carboxypeptidase B2
Ligand
BDBM50226598
Substrate
Meas. Tech.
ChEMBL_452077 (CHEMBL901238)
Ki
70±n/a nM
Citation
 Bunnage, MEBlagg, JSteele, JOwen, DRAllerton, CMcElroy, ABMiller, DRinger, TButcher, KBeaumont, KEvans, KGray, AJHolland, SJFeeder, NMoore, RSBrown, DG Discovery of potent& selective inhibitors of activated thrombin-activatable fibrinolysis inhibitor for the treatment of thrombosis. J Med Chem 50:6095-103 (2007)  
Target
Name:
Carboxypeptidase B2
Synonyms:
CBPB2_HUMAN CPU Carboxypeptidase B2 isoform A Plasma carboxypeptidase B Thrombin-activable fibrinolysis inhibitor | pCPB
Type:
Enzyme
Mol. Mass.:
48432.74
Organism:
Homo sapiens (Human)
Description:
Q96IY4
Residue:
423
  
Inhibitor
Name:
BDBM50226598
Synonyms:
(S)-2-(2-aminoethylamino)-3-(1-butyl-1H-imidazol-4-yl)propanoic acid | CHEMBL236549
Type:
Small organic molecule
Emp. Form.:
C12H22N4O2
Mol. Mass.:
254.3287
SMILES:
CCCCn1cnc(C[C@H](NCCN)C(O)=O)c1
: