Target
Melanocortin receptor 3
Ligand
BDBM50224185
Substrate
Meas. Tech.
ChEMBL_555530 (CHEMBL963790)
Ki
230±n/a nM
Citation
 Chen, CTucci, FCJiang, WTran, JAFleck, BAHoare, SRWen, JChen, TJohns, MMarkison, SFoster, ACMarinkovic, DChen, CWArellano, MHarman, JSaunders, JBozigian, HMarks, D Pharmacological and pharmacokinetic characterization of 2-piperazine-alpha-isopropyl benzylamine derivatives as melanocortin-4 receptor antagonists. Bioorg Med Chem 16:5606-18 (2008)  
Target
Name:
Melanocortin receptor 3
Synonyms:
MC3-R MC3R_HUMAN Melanocortin receptor (M3 and M4)
Type:
Enzyme
Mol. Mass.:
36044.86
Organism:
Homo sapiens (Human)
Description:
P41968
Residue:
323
  
Inhibitor
Name:
BDBM50224185
Synonyms:
1-{2-[(1S)-(methylaminoacetamido)-2-methylpropyl]-4-methylphenyl}-4-[(2R)-methyl-3-(2-fluoro-4-chlorophenyl)propionyl]piperazine N-((S)-1-(2-(4-((R)-3-(4-chloro-2-fluorophenyl)-2-methylpropanoyl)piperazin-1-yl)-5-methylphenyl)-2-methylpropyl)-2-(methylamino)acetamide
Type:
Small organic molecule
Emp. Form.:
C28H38ClFN4O2
Mol. Mass.:
517.078
SMILES:
CNCC(=O)N[C@@H](C(C)C)c1cc(C)ccc1N1CCN(CC1)C(=O)[C@H](C)Cc1ccc(Cl)cc1F
: