Target
Melanocortin receptor 4
Ligand
BDBM50224178
Substrate
Meas. Tech.
ChEMBL_533293 (CHEMBL973312)
Ki
6±n/a nM
Citation
 Chen, CTucci, FCJiang, WTran, JAFleck, BAHoare, SRWen, JChen, TJohns, MMarkison, SFoster, ACMarinkovic, DChen, CWArellano, MHarman, JSaunders, JBozigian, HMarks, D Pharmacological and pharmacokinetic characterization of 2-piperazine-alpha-isopropyl benzylamine derivatives as melanocortin-4 receptor antagonists. Bioorg Med Chem 16:5606-18 (2008)  
Target
Name:
Melanocortin receptor 4
Synonyms:
MC4-R MC4R_HUMAN Melanocortin receptor 4 (MC-4) Melanocortin receptor 4 (MC4R)
Type:
Enzyme
Mol. Mass.:
36949.50
Organism:
Homo sapiens (Human)
Description:
P32245
Residue:
332
  
Inhibitor
Name:
BDBM50224178
Synonyms:
(R)-3-(4-chloro-2-fluorophenyl)-2-methyl-1-(4-(4-methyl-2-((S)-2-methyl-1-(2-(methylamino)ethylamino)propyl)phenyl)piperazin-1-yl)propan-1-one CHEMBL240568
Type:
Small organic molecule
Emp. Form.:
C28H40ClFN4O
Mol. Mass.:
503.095
SMILES:
CNCCN[C@@H](C(C)C)c1cc(C)ccc1N1CCN(CC1)C(=O)[C@H](C)Cc1ccc(Cl)cc1F
: