Target
Growth hormone secretagogue receptor type 1
Ligand
BDBM50261195
Substrate
Meas. Tech.
ChEMBL_555532 (CHEMBL963792)
Ki
240±n/a nM
Citation
 Chen, CTucci, FCJiang, WTran, JAFleck, BAHoare, SRWen, JChen, TJohns, MMarkison, SFoster, ACMarinkovic, DChen, CWArellano, MHarman, JSaunders, JBozigian, HMarks, D Pharmacological and pharmacokinetic characterization of 2-piperazine-alpha-isopropyl benzylamine derivatives as melanocortin-4 receptor antagonists. Bioorg Med Chem 16:5606-18 (2008)  
Target
Name:
Growth hormone secretagogue receptor type 1
Synonyms:
GH-releasing peptide receptor GHS-R GHSR_HUMAN Ghrelin receptor | Ghrelin receptor 1a (GHS-R1a)
Type:
Receptor
Mol. Mass.:
41334.57
Organism:
Homo sapiens (Human)
Description:
Receptor binding studies use plasma membranes from LLC PK-1 cells transiently transfected with hGHSR1a.
Residue:
366
  
Inhibitor
Name:
BDBM50261195
Synonyms:
1-{2-[(1S)-(3-Dimethylaminopropionamino)-2-methylpropyl]-6-fluorophenyl}-4-[(2R)-methyl-3-(4-chlorophenyl)propionyl]piperazine | CHEMBL497746
Type:
Small organic molecule
Emp. Form.:
C29H40ClFN4O2
Mol. Mass.:
531.105
SMILES:
CC(C)[C@H](NC(=O)CCN(C)C)c1cccc(F)c1N1CCN(CC1)C(=O)[C@H](C)Cc1ccc(Cl)cc1
: