Target
Lysophosphatidic acid receptor 3
Ligand
BDBM50271700
Substrate
Meas. Tech.
ChEMBL_556435 (CHEMBL955652)
EC50
>11800±n/a nM
Citation
 Fells, JITsukahara, RFujiwara, YLiu, JPerygin, DHOsborne, DATigyi, GParrill, AL Identification of non-lipid LPA3 antagonists by virtual screening. Bioorg Med Chem 16:6207-17 (2008)  
Target
Name:
Lysophosphatidic acid receptor 3
Synonyms:
EDG7 LPAR3 Lysophosphatidic acid receptor 1/3 Lysophosphatidic acid receptor Edg-7
Type:
Enzyme
Mol. Mass.:
40149.72
Organism:
Homo sapiens (Human)
Description:
Q9UBY5
Residue:
353
  
Inhibitor
Name:
BDBM50271700
Synonyms:
4-(4-(ethoxycarbonyl)styryl)benzenesulfonic acid | CHEMBL483303
Type:
Small organic molecule
Emp. Form.:
C17H16O5S
Mol. Mass.:
332.371
SMILES:
CCOC(=O)c1ccc(\C=C\c2ccc(cc2)S(O)(=O)=O)cc1
: