Target
Sodium-dependent serotonin transporter
Ligand
BDBM50252219
Substrate
Meas. Tech.
ChEMBL_487557 (CHEMBL1013151)
Ki
4.6±n/a nM
Citation
 Zhou, DZhou, PEvrard, DAMeagher, KWebb, MHarrison, BLHuryn, DMGolembieski, JHornby, GASchechter, LESmith, DLAndree, THMewshaw, RE Studies toward the discovery of the next generation of antidepressants. Part 6: Dual 5-HT1A receptor and serotonin transporter affinity within a class of arylpiperazinyl-cyclohexyl indole derivatives. Bioorg Med Chem 16:6707-23 (2008)  
Target
Name:
Sodium-dependent serotonin transporter
Synonyms:
5-HT Transporter 5HT transporter Anandamid membrane transporter, AMT Monoamine transporters; Norepinephrine & serotonin Slc6a4 Sodium-dependent serotonin transporter (SERT) | imipramine receptor
Type:
Multi-pass membrane protein
Mol. Mass.:
70168.43
Organism:
Rattus norvegicus (rat)
Description:
P31652
Residue:
630
  
Inhibitor
Name:
BDBM50252219
Synonyms:
8-{4-[(1,4-cis)-4-(5-Fluoro-1H-indol-3-yl)-cyclohexyl]-piperazin-1-yl}-quinoline | CHEMBL481747
Type:
Small organic molecule
Emp. Form.:
C27H29FN4
Mol. Mass.:
428.5444
SMILES:
Fc1ccc2[nH]cc([C@@H]3CC[C@@H](CC3)N3CCN(CC3)c3cccc4cccnc34)c2c1
: