Target
5-hydroxytryptamine receptor 1A
Ligand
BDBM50262790
Substrate
Meas. Tech.
ChEMBL_491031 (CHEMBL982079)
Ki
0.52±n/a nM
Citation
 Siracusa, MASalerno, LModica, MNPittalà, VRomeo, GAmato, MENowak, MBojarski, AJMereghetti, ICagnotto, AMennini, T Synthesis of new arylpiperazinylalkylthiobenzimidazole, benzothiazole, or benzoxazole derivatives as potent and selective 5-HT1A serotonin receptor ligands. J Med Chem 51:4529-38 (2008)  
Target
Name:
5-hydroxytryptamine receptor 1A
Synonyms:
5-HT-1A 5-HT1A 5-hydroxytryptamine receptor 1A (5HT1A) 5ht1a Htr1a Serotonin 1a (5-HT1a) receptor/Adrenergic receptor alpha-1 | Serotonin receptor 1A
Type:
G Protein-Coupled Receptor (GPCR)
Mol. Mass.:
46445.29
Organism:
Rattus norvegicus (rat)
Description:
Binding assays were performed using rat hippocampal membranes.
Residue:
422
  
Inhibitor
Name:
BDBM50262790
Synonyms:
2-[[6-[4-(2-Methoxyphenyl)-1-piperazinyl]hexyl]thio]benzoxazole | CHEMBL476722
Type:
Small organic molecule
Emp. Form.:
C24H31N3O2S
Mol. Mass.:
425.587
SMILES:
COc1ccccc1N1CCN(CCCCCCSc2nc3ccccc3o2)CC1
: