Target
Lysosomal alpha-mannosidase
Ligand
BDBM50168988
Substrate
Meas. Tech.
ChEMBL_489068 (CHEMBL987288)
Ki
23300±n/a nM
Citation
 Fiaux, HKuntz, DAHoffman, DJanzer, RCGerber-Lemaire, SRose, DRJuillerat-Jeanneret, L Functionalized pyrrolidine inhibitors of human type II alpha-mannosidases as anti-cancer agents: optimizing the fit to the active site. Bioorg Med Chem 16:7337-46 (2008)  
Target
Name:
Lysosomal alpha-mannosidase
Synonyms:
LAMAN MAN2B1 | MANB
Type:
PROTEIN
Mol. Mass.:
113753.32
Organism:
Homo sapiens (Human)
Description:
ChEMBL_1432452
Residue:
1011
  
Inhibitor
Name:
BDBM50168988
Synonyms:
(2R,3R,4S)-2-({[(1R)-2-HYDROXY-1-PHENYLETHYL]AMINO}METHYL)PYRROLIDINE-3,4-DIOL | CHEMBL425723
Type:
Small organic molecule
Emp. Form.:
C13H20N2O3
Mol. Mass.:
252.3095
SMILES:
OC[C@H](NC[C@H]1NC[C@H](O)[C@@H]1O)c1ccccc1
: