Target
Sodium-dependent noradrenaline transporter
Ligand
BDBM30130
Substrate
Meas. Tech.
ChEMBL_510054 (CHEMBL995197)
IC50
2000±n/a nM
Citation
 Hudson, SKiankarimi, MEccles, WMostofi, YSGenicot, MJDwight, WFleck, BAGogas, KWade, WS Synthesis and structure-activity relationships of selective norepinephrine reuptake inhibitors (sNRI) with a heterocyclic ring constraint. Bioorg Med Chem Lett 18:4495-8 (2008)  
Target
Name:
Sodium-dependent noradrenaline transporter
Synonyms:
Monoamine transporter NET Noradrenaline Transporter (NET) Norepinephrine transporter protein (NET) SLC6A2 Sodium-dependent noradrenaline transporter (NET) | Solute carrier family 6 member 2
Type:
Multi-pass membrane protein
Mol. Mass.:
69337.72
Organism:
Homo sapiens (Human)
Description:
P23975
Residue:
617
  
Inhibitor
Name:
BDBM30130
Synonyms:
CHEMBL1201082 Fluoxetin Prozac cid_62857
Type:
Small organic molecule
Emp. Form.:
C17H18F3NO
Mol. Mass.:
309.3261
SMILES:
CNCCC(Oc1ccc(cc1)C(F)(F)F)c1ccccc1
: