Target
Monoglyceride lipase
Ligand
BDBM50247050
Substrate
Meas. Tech.
ChEMBL_557787 (CHEMBL953296)
IC50
70±n/a nM
Citation
 Nomura, DKHudak, CSWard, AMBurston, JJIssa, RSFisher, KJAbood, MEWiley, JLLichtman, AHCasida, JE Monoacylglycerol lipase regulates 2-arachidonoylglycerol action and arachidonic acid levels. Bioorg Med Chem Lett 18:5875-8 (2008)  
Target
Name:
Monoglyceride lipase
Synonyms:
MAG lipase Mgll Monoglyceride Lipase (MGL)
Type:
Hydrolase
Mol. Mass.:
33391.67
Organism:
Mus musculus (mouse)
Description:
Assays were using membranes of recombinant MAG Lipase transiently transfected in COS-7 cells.
Residue:
303
  
Inhibitor
Name:
BDBM50247050
Synonyms:
4-cyanophenyl ethyl dodecylphosphonate | CHEMBL462582
Type:
Small organic molecule
Emp. Form.:
C21H34NO3P
Mol. Mass.:
379.4733
SMILES:
CCCCCCCCCCCCP(=O)(OCC)Oc1ccc(cc1)C#N
: