Target
Sodium-dependent serotonin transporter
Ligand
BDBM50275438
Substrate
Meas. Tech.
ChEMBL_493415 (CHEMBL944372)
Ki
6.00±n/a nM
Citation
 Bannwart, LMCarter, DSCai, HYChoy, JCGreenhouse, RJaime-Figueroa, SIyer, PSLin, CJLee, EKLucas, MCLynch, SMMadera, AMMoore, AOzboya, KRaptova, LRoetz, RSchoenfeld, RCStein, KASteiner, SVilla, MWeikert, RJZhai, Y Novel 3,3-disubstituted pyrrolidines as selective triple serotonin/norepinephrine/dopamine reuptake inhibitors. Bioorg Med Chem Lett 18:6062-6 (2008)  
Target
Name:
Sodium-dependent serotonin transporter
Synonyms:
5-HT Transporter 5HTT SC6A4_HUMAN SLC6A4 Serotonin transporter (5HTT) Sodium-dependent serotonin transporter (SERT) | Solute carrier family 6 member 4
Type:
Multi-pass membrane protein
Mol. Mass.:
70322.51
Organism:
Homo sapiens (Human)
Description:
P31645
Residue:
630
  
Inhibitor
Name:
BDBM50275438
Synonyms:
(+)-5-(3-benzylpyrrolidin-3-yl)-1H-indole 5-(3-BENZYLPYRROLIDIN-3-YL)-1H-INDOLE (STRUCTURAL MIX) CHEMBL487355
Type:
Small organic molecule
Emp. Form.:
C19H20N2
Mol. Mass.:
276.3755
SMILES:
C(c1ccccc1)C1(CCNC1)c1ccc2[nH]ccc2c1
: