Target
Sodium-dependent noradrenaline transporter
Ligand
BDBM50274979
Substrate
Meas. Tech.
ChEMBL_493416 (CHEMBL944373)
Ki
9±n/a nM
Citation
 Bannwart, LMCarter, DSCai, HYChoy, JCGreenhouse, RJaime-Figueroa, SIyer, PSLin, CJLee, EKLucas, MCLynch, SMMadera, AMMoore, AOzboya, KRaptova, LRoetz, RSchoenfeld, RCStein, KASteiner, SVilla, MWeikert, RJZhai, Y Novel 3,3-disubstituted pyrrolidines as selective triple serotonin/norepinephrine/dopamine reuptake inhibitors. Bioorg Med Chem Lett 18:6062-6 (2008)  
Target
Name:
Sodium-dependent noradrenaline transporter
Synonyms:
Monoamine transporter NET Noradrenaline Transporter (NET) Norepinephrine transporter protein (NET) SLC6A2 Sodium-dependent noradrenaline transporter (NET) | Solute carrier family 6 member 2
Type:
Multi-pass membrane protein
Mol. Mass.:
69337.72
Organism:
Homo sapiens (Human)
Description:
P23975
Residue:
617
  
Inhibitor
Name:
BDBM50274979
Synonyms:
5-(3-butylpyrrolidin-3-yl)-1H-indole | CHEMBL463585
Type:
Small organic molecule
Emp. Form.:
C16H22N2
Mol. Mass.:
242.3593
SMILES:
CCCCC1(CCNC1)c1ccc2[nH]ccc2c1
: