Target
Ephrin type-A receptor 1
Ligand
BDBM50273637
Substrate
Meas. Tech.
ChEMBL_537107 (CHEMBL988939)
Kd
10±n/a nM
Citation
 Bamborough, PDrewry, DHarper, GSmith, GKSchneider, K Assessment of chemical coverage of kinome space and its implications for kinase drug discovery. J Med Chem 51:7898-914 (2008)  
Target
Name:
Ephrin type-A receptor 1
Synonyms:
EPH EPH tyrosine kinase 1 EPHA1_HUMAN EPHT1 Ephrin type-A receptor 1 Erythropoietin-producing hepatoma receptor hEpha1
Type:
Enzyme
Mol. Mass.:
108128.04
Organism:
Homo sapiens (Human)
Description:
P21709
Residue:
976
  
Inhibitor
Name:
BDBM50273637
Synonyms:
3-(4-amino-7-(piperidin-4-yl)-7H-pyrrolo[2,3-d]pyrimidin-5-yl)phenol | CHEMBL450519
Type:
Small organic molecule
Emp. Form.:
C17H19N5O
Mol. Mass.:
309.3657
SMILES:
Nc1ncnc2n(cc(-c3cccc(O)c3)c12)C1CCNCC1
: