Target
Tyrosine-protein kinase TXK
Ligand
BDBM26145
Substrate
Meas. Tech.
ChEMBL_537092 (CHEMBL988924)
Kd
10±n/a nM
Citation
 Bamborough, PDrewry, DHarper, GSmith, GKSchneider, K Assessment of chemical coverage of kinome space and its implications for kinase drug discovery. J Med Chem 51:7898-914 (2008)  
Target
Name:
Tyrosine-protein kinase TXK
Synonyms:
PTK4 RLK TXK Tyrosine-protein kinase TXK (TXK)
Type:
Protein
Mol. Mass.:
61268.80
Organism:
Homo sapiens (Human)
Description:
P42681
Residue:
527
  
Inhibitor
Name:
BDBM26145
Synonyms:
2,4-dianilino pyrimidine, 2 CHEMBL249097
Type:
Small organic molecule
Emp. Form.:
C18H17N5O2
Mol. Mass.:
335.3599
SMILES:
Cc1ccc(O)cc1Nc1ccnc(Nc2cccc(c2)C(N)=O)n1
: