Target
Atypical kinase COQ8B, mitochondrial
Ligand
BDBM26145
Substrate
Meas. Tech.
ChEMBL_537108 (CHEMBL988940)
Kd
129±n/a nM
Citation
 Bamborough, PDrewry, DHarper, GSmith, GKSchneider, K Assessment of chemical coverage of kinome space and its implications for kinase drug discovery. J Med Chem 51:7898-914 (2008)  
Target
Name:
Atypical kinase COQ8B, mitochondrial
Synonyms:
ADCK4 COQ8B_HUMAN | Uncharacterized aarF domain-containing protein kinase 4
Type:
PROTEIN
Mol. Mass.:
60073.32
Organism:
Homo sapiens (Human)
Description:
ChEMBL_586944
Residue:
544
  
Inhibitor
Name:
BDBM26145
Synonyms:
2,4-dianilino pyrimidine, 2 CHEMBL249097
Type:
Small organic molecule
Emp. Form.:
C18H17N5O2
Mol. Mass.:
335.3599
SMILES:
Cc1ccc(O)cc1Nc1ccnc(Nc2cccc(c2)C(N)=O)n1
: