Target
Glycogen phosphorylase, liver form
Ligand
BDBM50256267
Substrate
Meas. Tech.
ChEMBL_515050 (CHEMBL1034792)
IC50
732±n/a nM
Citation
 Sparks, SMBanker, PBickett, DMCarter, HLClancy, DCDickerson, SHDwornik, KAGarrido, DMGolden, PLNolte, RTPeat, AJSheckler, LRTavares, FXThomson, SAWang, LWeiel, JE Anthranilimide-based glycogen phosphorylase inhibitors for the treatment of type 2 diabetes: 1. Identification of 1-amino-1-cycloalkyl carboxylic acid headgroups. Bioorg Med Chem Lett 19:976-80 (2009)  
Target
Name:
Glycogen phosphorylase, liver form
Synonyms:
Glycogen Phosphorylase (PYGL) Liver glycogen phosphorylase PYGL_HUMAN
Type:
Homodimer
Mol. Mass.:
97153.98
Organism:
Homo sapiens (Human)
Description:
Dimers associate into a tetramer to form the enzymatically active phosphorylase A.
Residue:
847
  
Inhibitor
Name:
BDBM50256267
Synonyms:
2-(3-(3-mesitylureido)-2-naphthamido)-2-propylpentanoic acid | CHEMBL472319
Type:
Small organic molecule
Emp. Form.:
C29H35N3O4
Mol. Mass.:
489.6059
SMILES:
CCCC(CCC)(NC(=O)c1cc2ccccc2cc1NC(=O)Nc1c(C)cc(C)cc1C)C(O)=O
: