Target
Glycogen phosphorylase, liver form
Ligand
BDBM27725
Substrate
Meas. Tech.
ChEMBL_515051 (CHEMBL1034793)
IC50
460±n/a nM
Citation
 Sparks, SMBanker, PBickett, DMCarter, HLClancy, DCDickerson, SHDwornik, KAGarrido, DMGolden, PLNolte, RTPeat, AJSheckler, LRTavares, FXThomson, SAWang, LWeiel, JE Anthranilimide-based glycogen phosphorylase inhibitors for the treatment of type 2 diabetes: 1. Identification of 1-amino-1-cycloalkyl carboxylic acid headgroups. Bioorg Med Chem Lett 19:976-80 (2009)  
Target
Name:
Glycogen phosphorylase, liver form
Synonyms:
Glycogen Phosphorylase (PYGL) Liver glycogen phosphorylase PYGL_HUMAN
Type:
Homodimer
Mol. Mass.:
97153.98
Organism:
Homo sapiens (Human)
Description:
Dimers associate into a tetramer to form the enzymatically active phosphorylase A.
Residue:
847
  
Inhibitor
Name:
BDBM27725
Synonyms:
(2S)-2-[(3-{[(2-chloro-6-methylphenyl)carbamoyl]amino}naphthalen-2-yl)formamido]-2-cyclohexylacetic acid anthranilimide based compound, 1
Type:
Small organic molecule
Emp. Form.:
C27H28ClN3O4
Mol. Mass.:
493.982
SMILES:
Cc1cccc(Cl)c1NC(=O)Nc1cc2ccccc2cc1C(=O)N[C@@H](C1CCCCC1)C(O)=O
: