Target
Glycogen phosphorylase, liver form
Ligand
BDBM50256117
Substrate
Meas. Tech.
ChEMBL_515052 (CHEMBL1034794)
IC50
>10000±n/a nM
Citation
 Sparks, SMBanker, PBickett, DMCarter, HLClancy, DCDickerson, SHDwornik, KAGarrido, DMGolden, PLNolte, RTPeat, AJSheckler, LRTavares, FXThomson, SAWang, LWeiel, JE Anthranilimide-based glycogen phosphorylase inhibitors for the treatment of type 2 diabetes: 1. Identification of 1-amino-1-cycloalkyl carboxylic acid headgroups. Bioorg Med Chem Lett 19:976-80 (2009)  
Target
Name:
Glycogen phosphorylase, liver form
Synonyms:
Glycogen Phosphorylase (PYGL) Liver glycogen phosphorylase PYGL_HUMAN
Type:
Homodimer
Mol. Mass.:
97153.98
Organism:
Homo sapiens (Human)
Description:
Dimers associate into a tetramer to form the enzymatically active phosphorylase A.
Residue:
847
  
Inhibitor
Name:
BDBM50256117
Synonyms:
2-(3-(3-mesitylureido)-2-naphthamido)-2-(4-oxocyclohexyl)acetic acid | CHEMBL473421
Type:
Small organic molecule
Emp. Form.:
C29H31N3O5
Mol. Mass.:
501.5735
SMILES:
Cc1cc(C)c(NC(=O)Nc2cc3ccccc3cc2C(=O)NC(C2CCC(=O)CC2)C(O)=O)c(C)c1
: