Target
Cytochrome P450 2C9
Ligand
BDBM50256117
Substrate
Meas. Tech.
ChEMBL_515053 (CHEMBL1034795)
IC50
9400±n/a nM
Citation
 Sparks, SMBanker, PBickett, DMCarter, HLClancy, DCDickerson, SHDwornik, KAGarrido, DMGolden, PLNolte, RTPeat, AJSheckler, LRTavares, FXThomson, SAWang, LWeiel, JE Anthranilimide-based glycogen phosphorylase inhibitors for the treatment of type 2 diabetes: 1. Identification of 1-amino-1-cycloalkyl carboxylic acid headgroups. Bioorg Med Chem Lett 19:976-80 (2009)  
Target
Name:
Cytochrome P450 2C9
Synonyms:
(R)-limonene 6-monooxygenase CP2C9_HUMAN CYP2C9 Cytochrome P450 2C9 (CYP2C9 ) P-450MP P450 PB-1 | S-mephenytoin 4-hydroxylase
Type:
Enzyme
Mol. Mass.:
55636.33
Organism:
Homo sapiens (Human)
Description:
P11712
Residue:
490
  
Inhibitor
Name:
BDBM50256117
Synonyms:
2-(3-(3-mesitylureido)-2-naphthamido)-2-(4-oxocyclohexyl)acetic acid | CHEMBL473421
Type:
Small organic molecule
Emp. Form.:
C29H31N3O5
Mol. Mass.:
501.5735
SMILES:
Cc1cc(C)c(NC(=O)Nc2cc3ccccc3cc2C(=O)NC(C2CCC(=O)CC2)C(O)=O)c(C)c1
: