Target
Glycogen phosphorylase, liver form
Ligand
BDBM50256442
Substrate
Meas. Tech.
ChEMBL_515066 (CHEMBL1034808)
IC50
1138±n/a nM
Citation
 Sparks, SMBanker, PBickett, DMClancy, DCDickerson, SHGarrido, DMGolden, PLPeat, AJSheckler, LRTavares, FXThomson, SAWeiel, JE Anthranilimide-based glycogen phosphorylase inhibitors for the treatment of Type 2 diabetes: 2. Optimization of serine and threonine ether amino acid residues. Bioorg Med Chem Lett 19:981-5 (2009)  
Target
Name:
Glycogen phosphorylase, liver form
Synonyms:
Glycogen Phosphorylase (PYGL) Liver glycogen phosphorylase PYGL_HUMAN
Type:
Homodimer
Mol. Mass.:
97153.98
Organism:
Homo sapiens (Human)
Description:
Dimers associate into a tetramer to form the enzymatically active phosphorylase A.
Residue:
847
  
Inhibitor
Name:
BDBM50256442
Synonyms:
(S)-2-(3-(3-mesitylureido)-2-naphthamido)-3,3-dimethylbutanoic acid | CHEMBL475764
Type:
Small organic molecule
Emp. Form.:
C27H31N3O4
Mol. Mass.:
461.5527
SMILES:
Cc1cc(C)c(NC(=O)Nc2cc3ccccc3cc2C(=O)N[C@H](C(O)=O)C(C)(C)C)c(C)c1
: