Target
Sodium- and chloride-dependent glycine transporter 1
Ligand
BDBM50248641
Substrate
Meas. Tech.
ChEMBL_542991 (CHEMBL1018607)
IC50
2.6±n/a nM
Citation
 Zhao, ZLeister, WHO'Brien, JALemaire, WWilliams, DLJacobson, MASur, CKinney, GGPettibone, DJTiller, PRSmith, SHartman, GDLindsley, CWWolkenberg, SE Discovery of N-{[1-(propylsulfonyl)-4-pyridin-2-ylpiperidin-4-yl]methyl}benzamides as novel, selective and potent GlyT1 inhibitors. Bioorg Med Chem Lett 19:1488-91 (2009)  
Target
Name:
Sodium- and chloride-dependent glycine transporter 1
Synonyms:
GlyT-1 Glycine Transporters (GlyT1c) SC6A9_HUMAN Sodium- and chloride-dependent glycine transporter 1 Sodium- and chloride-dependent glycine transporter 1 (GlyT1c) Solute carrier family 6 member 9
Type:
Enzyme
Mol. Mass.:
78270.54
Organism:
Homo sapiens (Human)
Description:
P48067
Residue:
706
  
Inhibitor
Name:
BDBM50248641
Synonyms:
2-amino-6-chloro-N-((4-phenyl-1-(propylsulfonyl)piperidin-4-yl)methyl)benzamide | CHEMBL463477
Type:
Small organic molecule
Emp. Form.:
C23H30ClN3O3S
Mol. Mass.:
464.021
SMILES:
CCCS(=O)(=O)N1CCC(CC1)([C@H](C)NC(=O)c1c(N)cccc1Cl)c1ccccc1
: