Target
Sodium- and chloride-dependent glycine transporter 1
Ligand
BDBM50248058
Substrate
Meas. Tech.
ChEMBL_542992 (CHEMBL1018608)
IC50
3±n/a nM
Citation
 Zhao, ZLeister, WHO'Brien, JALemaire, WWilliams, DLJacobson, MASur, CKinney, GGPettibone, DJTiller, PRSmith, SHartman, GDLindsley, CWWolkenberg, SE Discovery of N-{[1-(propylsulfonyl)-4-pyridin-2-ylpiperidin-4-yl]methyl}benzamides as novel, selective and potent GlyT1 inhibitors. Bioorg Med Chem Lett 19:1488-91 (2009)  
Target
Name:
Sodium- and chloride-dependent glycine transporter 1
Synonyms:
GlyT-1 Glycine Transporters (GlyT1c) SC6A9_HUMAN Sodium- and chloride-dependent glycine transporter 1 Sodium- and chloride-dependent glycine transporter 1 (GlyT1c) Solute carrier family 6 member 9
Type:
Enzyme
Mol. Mass.:
78270.54
Organism:
Homo sapiens (Human)
Description:
P48067
Residue:
706
  
Inhibitor
Name:
BDBM50248058
Synonyms:
(S)-2,4-dichloro-N-(1-(1-(propylsulfonyl)-4-(pyridin-2-yl)piperidin-4-yl)ethyl)benzamide | CHEMBL460537
Type:
Small organic molecule
Emp. Form.:
C22H27Cl2N3O3S
Mol. Mass.:
484.439
SMILES:
CCCS(=O)(=O)N1CCC(CC1)([C@H](C)NC(=O)c1ccc(Cl)cc1Cl)c1ccccn1
: