Target
Low molecular weight phosphotyrosine protein phosphatase
Ligand
BDBM50257477
Substrate
Meas. Tech.
ChEMBL_562673 (CHEMBL1011832)
IC50
1300±n/a nM
Citation
 Forghieri, MLaggner, CPaoli, PLanger, TManao, GCamici, GBondioli, LPrati, FCostantino, L Synthesis, activity and molecular modeling of a new series of chromones as low molecular weight protein tyrosine phosphatase inhibitors. Bioorg Med Chem 17:2658-72 (2009)  
Target
Name:
Low molecular weight phosphotyrosine protein phosphatase
Synonyms:
3.1.3.2 ACP1 LMW-PTP LMWPTP PPAC_HUMAN low molecular weight phosphotyrosine protein phosphatase isoform c
Type:
Mol. Mass.:
18042.81
Organism:
Homo sapiens (Human)
Description:
P24666
Residue:
158
  
Inhibitor
Name:
BDBM50257477
Synonyms:
7-Hydroxy-2-(4'-hydroxyphenyl)-3-[(4''carboxy-3''-hydroxy-1,1'-biphenyl-4-yl)methyl]-4H-1-benzopyran-4-one | CHEMBL495142
Type:
Small organic molecule
Emp. Form.:
C29H20O7
Mol. Mass.:
480.4649
SMILES:
OC(=O)c1ccc(cc1O)-c1ccc(Cc2c(oc3cc(O)ccc3c2=O)-c2ccc(O)cc2)cc1
: