Target
Type-1 angiotensin II receptor A/B
Ligand
BDBM50285825
Substrate
Meas. Tech.
ChEMBL_36648 (CHEMBL652358)
IC50
8±n/a nM
Citation
 Mederski, WWDorsch, DOsswald, MBeier, NLues, IMinck, KOSchelling, PLadstetter, BJ 4,5-Dihydro-4-oxo-3H-imidazo[4,5-c]pyridines: potent arylacetic acid-derived AT1 antagonists with improved affinity for the AT2 receptor Bioorg Med Chem Lett 5:2665-2670 (1995)    Article 
Target
Name:
Type-1 angiotensin II receptor A/B
Synonyms:
Angiotensin II receptor (AT-1) type-1 | Type-1A/Type-1B angiotensin II receptor
Type:
Mol. Mass.:
Description:
ASSAY_ID of ChEMBL is 901964
Components:
This complex has 2 components.
Component 1
Name:
Type-1 angiotensin II receptor B
Synonyms:
AGTRB_RAT Agtr1 Angiotensin II AT1B Angiotensin II type 1b (AT-1b) receptor Type-1B angiotensin II receptor
Type:
Enzyme Catalytic Domain
Mol. Mass.:
40929.44
Organism:
RAT
Description:
Angiotensin II AT1B 0 RAT::P29089
Residue:
359
  
Component 2
Name:
Type-1 angiotensin II receptor A
Synonyms:
AGTRA_RAT Agtr1 Angiotensin II AT1 Angiotensin II receptor (AT-1) type-1 Type-1A angiotensin II receptor
Type:
Enzyme Catalytic Domain
Mol. Mass.:
40910.53
Organism:
RAT
Description:
ANGIOTENSIN AT1 AGTR1 RAT::P25095
Residue:
359
  
Inhibitor
Name:
BDBM50285825
Synonyms:
2-Butyl-5-(2-oxo-1,2-diphenyl-ethyl)-3-[2'-(1H-tetrazol-5-yl)-biphenyl-4-ylmethyl]-3,5-dihydro-imidazo[4,5-c]pyridin-4-one | CHEMBL328997
Type:
Small organic molecule
Emp. Form.:
C38H33N7O2
Mol. Mass.:
619.7143
SMILES:
CCCCc1nc2ccn(C(C(=O)c3ccccc3)c3ccccc3)c(=O)c2n1Cc1ccc(cc1)-c1ccccc1-c1nnn[nH]1
: