Target
Cathepsin D
Ligand
BDBM50080991
Substrate
Meas. Tech.
ChEMBL_45184 (CHEMBL658683)
IC50
1300±n/a nM
Citation
 Whitesitt, CASimon, RLReel, JKSigmund, SKPhillips, MLShadle, JKHeinz, LJKoppel, GAHunden, DCLifer, SLBerry, DRay, JLittle, SPLiu, XMarshall, WSPanetta, JA Synthesis and structure-activity relationships of benzophenones as inhibitors of cathepsin D Bioorg Med Chem Lett 6:2157-2162 (1996)    Article 
Target
Name:
Cathepsin D
Synonyms:
CATD_HUMAN CTSD Cathepsin D heavy chain Cathepsin D precursor
Type:
Enzyme
Mol. Mass.:
44551.72
Organism:
Homo sapiens (Human)
Description:
Human proCathepsin D (SwissProt accession number P07339) was expressed in Sf9 cells, purified, and autoactivated.
Residue:
412
  
Inhibitor
Name:
BDBM50080991
Synonyms:
5-[1-[4-(4-Benzoyl-3-hydroxy-2-propyl-phenoxymethyl)-phenyl]-meth-(Z)-ylidene]-2-thioxo-thiazolidin-4-one | CHEMBL68595
Type:
Small organic molecule
Emp. Form.:
C27H23NO4S2
Mol. Mass.:
489.606
SMILES:
CCCc1c(O)c(ccc1OCc1ccc(C=C2SC(S)=NC2=O)cc1)C(=O)c1ccccc1
: