Target
Prothrombin
Ligand
BDBM50289591
Substrate
Meas. Tech.
ChEBML_208719
Ki
0.360000±n/a nM
Citation
 Quan, MLWityak, JDominguez, CDuncia, JVKettner, CAEllis, CDLiauw, AYPark, JMSantella, JBKnabb, RMThoolen, MJWeber, PCWexler, RR Biaryl substituted alkylboronate esters as thrombin inhibitors Bioorg Med Chem Lett 7:1595-1600 (1997)    Article 
Target
Name:
Prothrombin
Synonyms:
Activation peptide fragment 1 Coagulation factor II Prothrombin precursor Thrombin heavy chain | Thrombin light chain
Type:
Protein
Mol. Mass.:
70029.57
Organism:
Homo sapiens (Human)
Description:
P00734
Residue:
622
  
Inhibitor
Name:
BDBM50289591
Synonyms:
2'-Diethylsulfamoyl-3-methyl-biphenyl-4-carboxylic acid [(R)-4-guanidino-1-((2S,6R)-2,9,9-trimethyl-3,5-dioxa-4-bora-tricyclo[6.1.1.0*2,6*]dec-4-yl)-butyl]-amide | CHEMBL290212
Type:
Small organic molecule
Emp. Form.:
C33H48BN5O5S
Mol. Mass.:
637.641
SMILES:
CCN(CC)S(=O)(=O)c1ccccc1-c1ccc(C(=O)N[C@@H](CCCNC(N)=N)B2O[C@@H]3CC4CC(C4(C)C)[C@]3(C)O2)c(C)c1
: