Target
Muscarinic acetylcholine receptor M2
Ligand
BDBM50064176
Substrate
Meas. Tech.
ChEMBL_485933 (CHEMBL1013936)
Ki
0.600000±n/a nM
Citation
 Sweetnam, PMCaldwell, LLancaster, JJr., CBMcMillan, BKinnier, WJPrice, CH The Role of Receptor Binding in Drug Discovery J Nat Prod 56:441-455 (1993)  
Target
Name:
Muscarinic acetylcholine receptor M2
Synonyms:
ACM2_HUMAN Cholinergic, muscarinic M2 Muscarinic acetylcholine receptor M2 and M5 | RecName: Full=Muscarinic acetylcholine receptor M2
Type:
GPCR
Mol. Mass.:
51730.61
Organism:
Homo sapiens (Human)
Description:
P08172
Residue:
466
  
Inhibitor
Name:
BDBM50064176
Synonyms:
CHEMBL27673 METHOCTRAMINE N1,N8-bis(6-(2-methoxybenzylamino)hexyl)octane-1,8-diamine
Type:
Small organic molecule
Emp. Form.:
C36H62N4O2
Mol. Mass.:
582.9031
SMILES:
COc1ccccc1CNCCCCCCNCCCCCCCCNCCCCCCNCc1ccccc1OC
: