Target
Dipeptidyl peptidase 9
Ligand
BDBM50296134
Substrate
Meas. Tech.
ChEMBL_579506 (CHEMBL1058860)
IC50
80±n/a nM
Citation
 Nordhoff, SCerezo-Gálvez, SDeppe, HHill, OLópez-Canet, MRummey, CThiemann, MMatassa, VGEdwards, PJFeurer, A Discovery of beta-homophenylalanine based pyrrolidin-2-ylmethyl amides and sulfonamides as highly potent and selective inhibitors of dipeptidyl peptidase IV. Bioorg Med Chem Lett 19:4201-3 (2009)  
Target
Name:
Dipeptidyl peptidase 9
Synonyms:
DPP9 DPRP-2 Dipeptidyl peptidase 9 (DDP9) Dipeptidyl peptidase 9 (DPP9) Dipeptidyl peptidase IX Dipeptidyl peptidase-like protein 9
Type:
Enzyme
Mol. Mass.:
98260.70
Organism:
Homo sapiens (Human)
Description:
Q86TI2
Residue:
863
  
Inhibitor
Name:
BDBM50296134
Synonyms:
CHEMBL539187 | N-(((S)-1-((R)-3-amino-4-(2-fluorophenyl)butanoyl)pyrrolidin-2-yl)methyl)benzenesulfonamide
Type:
Small organic molecule
Emp. Form.:
C21H26FN3O3S
Mol. Mass.:
419.513
SMILES:
N[C@@H](CC(=O)N1CCC[C@H]1CNS(=O)(=O)c1ccccc1)Cc1ccccc1F
: