Target
Cytochrome P450 2D6
Ligand
BDBM50297306
Substrate
Meas. Tech.
ChEMBL_582987 (CHEMBL1051825)
IC50
200±n/a nM
Citation
 Moree, WJLi, BFJovic, FCoon, TYu, JGross, RSTucci, FMarinkovic, DZamani-Kord, SMalany, SBradbury, MJHernandez, LMO'Brien, ZWen, JWang, HHoare, SRPetroski, RESacaan, AMadan, ACrowe, PDBeaton, G Characterization of novel selective H1-antihistamines for clinical evaluation in the treatment of insomnia. J Med Chem 52:5307-10 (2009)  
Target
Name:
Cytochrome P450 2D6
Synonyms:
CP2D6_HUMAN CYP2DL1 Cytochrome P450 2D6 (CYP2D6) P450-DB1
Type:
Protein
Mol. Mass.:
55774.82
Organism:
Homo sapiens (Human)
Description:
P10635
Residue:
497
  
Inhibitor
Name:
BDBM50297306
Synonyms:
CHEMBL540982 | {2-[3-(4-Fluoro-benzyl)-benzo[b]thiophen-2-yl]-ethyl}-dimethyl-amine
Type:
Small organic molecule
Emp. Form.:
C19H20FNS
Mol. Mass.:
313.432
SMILES:
CN(C)CCc1sc2ccccc2c1Cc1ccc(F)cc1
: