Target
Tryptophan 5-hydroxylase 1
Ligand
BDBM50243613
Substrate
Meas. Tech.
ChEMBL_597945 (CHEMBL1042730)
IC50
24±n/a nM
Citation
 Jin, HCianchetta, GDevasagayaraj, AGu, KMarinelli, BSamala, LScott, SStouch, TTunoori, AWang, YZang, YZhang, CDavid Kimball, SMain, AJDing, ZMSun, WYang, QYu, XQPowell, DRWilson, ALiu, QShi, ZC Substituted 3-(4-(1,3,5-triazin-2-yl)-phenyl)-2-aminopropanoic acids as novel tryptophan hydroxylase inhibitors. Bioorg Med Chem Lett 19:5229-32 (2009)  
Target
Name:
Tryptophan 5-hydroxylase 1
Synonyms:
TPH TPH1_HUMAN TRPH | Tryptophan 5-monooxygenase 1
Type:
PROTEIN
Mol. Mass.:
50990.64
Organism:
Homo sapiens (Human)
Description:
ChEMBL_1361824
Residue:
444
  
Inhibitor
Name:
BDBM50243613
Synonyms:
(S)-2-Amino-3-(4-(4-amino-6-((naphthalene-2-ylmethyl)-amino)-(1,3,5)triazin-2-yl)-phenyl)-propionic acid CHEMBL460882
Type:
Small organic molecule
Emp. Form.:
C23H22N6O2
Mol. Mass.:
414.4598
SMILES:
N[C@@H](Cc1ccc(cc1)-c1nc(N)nc(NCc2ccc3ccccc3c2)n1)C(O)=O
: