Target
Egl nine homolog 1
Ligand
BDBM50303766
Substrate
Meas. Tech.
ChEMBL_597534 (CHEMBL1047009)
Kd
900±n/a nM
Citation
 Leung, IKFlashman, EYeoh, KKSchofield, CJClaridge, TD Using NMR solvent water relaxation to investigate metalloenzyme-ligand binding interactions. J Med Chem 53:867-75 (2010)  
Target
Name:
Egl nine homolog 1
Synonyms:
C1orf12 EGLN1_HUMAN Hypoxia-inducible factor prolyl hydroxylase 2 (HIF-PH2) Prolyl hydroxylase domain-containing protein 2 (PHD2)
Type:
Protein
Mol. Mass.:
46035.59
Organism:
Homo sapiens (Human)
Description:
Q9GZT9
Residue:
426
  
Inhibitor
Name:
BDBM50303766
Synonyms:
2-oxoglutaric acid CHEMBL1686 | alpha-ketoglutaric acid
Type:
Small organic molecule
Emp. Form.:
C5H6O5
Mol. Mass.:
146.0981
SMILES:
OC(=O)CCC(=O)C(O)=O
: