Target
Mu-type opioid receptor
Ligand
BDBM50304078
Substrate
Meas. Tech.
ChEMBL_601678 (CHEMBL1049576)
IC50
>10000±n/a nM
Citation
 Peng, YZhang, QArora, SKeenan, SMKortagere, SWannemacher, KMHowells, RDWelsh, WJ Novel delta opioid receptor agonists exhibit differential stimulation of signaling pathways. Bioorg Med Chem 17:6442-50 (2009)  
Target
Name:
Mu-type opioid receptor
Synonyms:
M-OR-1 Mor OPRM_MOUSE Oprm | Oprm1
Type:
Enzyme Catalytic Domain
Mol. Mass.:
44431.62
Organism:
MOUSE
Description:
OPIATE Mu OPRM1 MOUSE::P42866
Residue:
398
  
Inhibitor
Name:
BDBM50304078
Synonyms:
(1-(3-tert-Butylphenyl)-5-(3-methoxyphenyl)-1H-1,2,4-triazol-3-yl)-N,N-dimethylmethanamine | CHEMBL593844
Type:
Small organic molecule
Emp. Form.:
C22H28N4O
Mol. Mass.:
364.4839
SMILES:
COc1cccc(c1)-c1nc(CN(C)C)nn1-c1cccc(c1)C(C)(C)C
: