Target
Lysophosphatidic acid receptor 5
Ligand
BDBM50304580
Substrate
Meas. Tech.
ChEMBL_605128 (CHEMBL1064671)
Ki
292±n/a nM
Citation
 Fells, JITsukahara, RLiu, JTigyi, GParrill, AL Structure-based drug design identifies novel LPA3 antagonists. Bioorg Med Chem 17:7457-64 (2009)  
Target
Name:
Lysophosphatidic acid receptor 5
Synonyms:
GPR92 LPAR5 Lysophosphatidic acid receptor 5 | Lysophosphatidic acid receptor 5 (LPA5)
Type:
Enzyme
Mol. Mass.:
41372.36
Organism:
Homo sapiens (Human)
Description:
Q9H1C0
Residue:
372
  
Inhibitor
Name:
BDBM50304580
Synonyms:
2-(3-(4-nitrophenoxy)phenyl)-1,3-dioxoisoindoline-5-carboxylic acid | CHEMBL604677
Type:
Small organic molecule
Emp. Form.:
C21H12N2O7
Mol. Mass.:
404.3292
SMILES:
OC(=O)c1ccc2C(=O)N(C(=O)c2c1)c1cccc(Oc2ccc(cc2)[N+]([O-])=O)c1
: