Target
Lysophosphatidic acid receptor 3
Ligand
BDBM50304581
Substrate
Meas. Tech.
ChEMBL_605127 (CHEMBL1064670)
Ki
1084±n/a nM
Citation
 Fells, JITsukahara, RLiu, JTigyi, GParrill, AL Structure-based drug design identifies novel LPA3 antagonists. Bioorg Med Chem 17:7457-64 (2009)  
Target
Name:
Lysophosphatidic acid receptor 3
Synonyms:
EDG7 LPAR3 Lysophosphatidic acid receptor 1/3 Lysophosphatidic acid receptor Edg-7
Type:
Enzyme
Mol. Mass.:
40149.72
Organism:
Homo sapiens (Human)
Description:
Q9UBY5
Residue:
353
  
Inhibitor
Name:
BDBM50304581
Synonyms:
2-(1,3-dioxo-5-(p-tolyloxy)isoindolin-2-yl)acetic acid | CHEMBL607806
Type:
Small organic molecule
Emp. Form.:
C17H13NO5
Mol. Mass.:
311.2888
SMILES:
Cc1ccc(Oc2ccc3C(=O)N(CC(O)=O)C(=O)c3c2)cc1
: