Target
Beta-secretase 1
Ligand
BDBM50300710
Substrate
Meas. Tech.
ChEMBL_603776 (CHEMBL1042914)
IC50
38000±n/a nM
Citation
 Nowak, PCole, DCAulabaugh, ABard, JChopra, RCowling, RFan, KYHu, BJacobsen, SJani, MJin, GLo, MCMalamas, MSManas, ESNarasimhan, RReinhart, PRobichaud, AJStock, JRSubrath, JSvenson, KTurner, JWagner, EZhou, PEllingboe, JW Discovery and initial optimization of 5,5'-disubstituted aminohydantoins as potent beta-secretase (BACE1) inhibitors. Bioorg Med Chem Lett 20:632-5 (2010)  
Target
Name:
Beta-secretase 1
Synonyms:
ASP2 Aspartyl protease 2 BACE1 Beta-secretase (BACE) Beta-secretase 1 (BACE 1) Beta-secretase 1 (BACE1) Beta-site amyloid precursor protein cleaving enzyme 1 Memapsin-2 beta-Secretase (BACE-1) | beta-Secretase (BACE1)
Type:
Protein
Mol. Mass.:
55755.10
Organism:
Homo sapiens (Human)
Description:
P56817
Residue:
501
  
Inhibitor
Name:
BDBM50300710
Synonyms:
8,8-diphenyl-2,3,4,8-tetrahydroimidazo[1,5-a]pyrimidin-6-amine | CHEMBL582044
Type:
Small organic molecule
Emp. Form.:
C18H18N4
Mol. Mass.:
290.3623
SMILES:
NC1=NC(C2=NCCCN12)(c1ccccc1)c1ccccc1
: