Target
Beta-secretase 1
Ligand
BDBM50305472
Substrate
Meas. Tech.
ChEMBL_603776 (CHEMBL1042914)
IC50
210±n/a nM
Citation
 Nowak, PCole, DCAulabaugh, ABard, JChopra, RCowling, RFan, KYHu, BJacobsen, SJani, MJin, GLo, MCMalamas, MSManas, ESNarasimhan, RReinhart, PRobichaud, AJStock, JRSubrath, JSvenson, KTurner, JWagner, EZhou, PEllingboe, JW Discovery and initial optimization of 5,5'-disubstituted aminohydantoins as potent beta-secretase (BACE1) inhibitors. Bioorg Med Chem Lett 20:632-5 (2010)  
Target
Name:
Beta-secretase 1
Synonyms:
ASP2 Aspartyl protease 2 BACE1 Beta-secretase (BACE) Beta-secretase 1 (BACE 1) Beta-secretase 1 (BACE1) Beta-site amyloid precursor protein cleaving enzyme 1 Memapsin-2 beta-Secretase (BACE-1) | beta-Secretase (BACE1)
Type:
Protein
Mol. Mass.:
55755.10
Organism:
Homo sapiens (Human)
Description:
P56817
Residue:
501
  
Inhibitor
Name:
BDBM50305472
Synonyms:
CHEMBL589614 | N-(3-(2-amino-4-cyclohexyl-1-methyl-5-oxo-4,5-dihydro-1H-imidazol-4-yl)phenyl)-2-methoxyacetamide
Type:
Small organic molecule
Emp. Form.:
C19H26N4O3
Mol. Mass.:
358.4347
SMILES:
COCC(=O)Nc1cccc(c1)C1(N=C(N)N(C)C1=O)C1CCCCC1
: