Target
Oxysterols receptor LXR-beta
Ligand
BDBM50306073
Substrate
Meas. Tech.
ChEMBL_605983 (CHEMBL1069927)
IC50
4.7±n/a nM
Citation
 Travins, JMBernotas, RCKaufman, DHQuinet, ENambi, PFeingold, IHuselton, CWilhelmsson, AGoos-Nilsson, AWrobel, J 1-(3-Aryloxyaryl)benzimidazole sulfones are liver X receptor agonists. Bioorg Med Chem Lett 20:526-30 (2010)  
Target
Name:
Oxysterols receptor LXR-beta
Synonyms:
LXRB Liver X, LXR beta NR1H2 Nuclear receptor NER Ubiquitously-expressed nuclear receptor
Type:
Enzyme Catalytic Domain
Mol. Mass.:
50978.79
Organism:
Homo sapiens (Human)
Description:
P55055
Residue:
460
  
Inhibitor
Name:
BDBM50306073
Synonyms:
1-(3-(3-(methylsulfonyl)phenoxy)phenyl)-2-phenyl-4-(trifluoromethyl)-1H-benzo[d]imidazole | CHEMBL595224
Type:
Small organic molecule
Emp. Form.:
C27H19F3N2O3S
Mol. Mass.:
508.512
SMILES:
CS(=O)(=O)c1cccc(Oc2cccc(c2)-n2c(nc3c(cccc23)C(F)(F)F)-c2ccccc2)c1
: