Target
Oxysterols receptor LXR-alpha
Ligand
BDBM50306065
Substrate
Meas. Tech.
ChEMBL_605982 (CHEMBL1069926)
IC50
13±n/a nM
Citation
 Travins, JMBernotas, RCKaufman, DHQuinet, ENambi, PFeingold, IHuselton, CWilhelmsson, AGoos-Nilsson, AWrobel, J 1-(3-Aryloxyaryl)benzimidazole sulfones are liver X receptor agonists. Bioorg Med Chem Lett 20:526-30 (2010)  
Target
Name:
Oxysterols receptor LXR-alpha
Synonyms:
LXRA Liver X receptor alpha Liver X receptor alpha (NR1H3) NR1H3 Nuclear orphan receptor LXR-alpha | Nuclear receptor subfamily 1 group H member 3
Type:
Enzyme Catalytic Domain
Mol. Mass.:
50403.85
Organism:
Homo sapiens (Human)
Description:
Q13133
Residue:
447
  
Inhibitor
Name:
BDBM50306065
Synonyms:
1-(3-(3-fluoro-5-(methylsulfonyl)phenoxy)phenyl)-2-methyl-4-(trifluoromethyl)-1H-benzo[d]imidazole | CHEMBL594983
Type:
Small organic molecule
Emp. Form.:
C22H16F4N2O3S
Mol. Mass.:
464.433
SMILES:
Cc1nc2c(cccc2n1-c1cccc(Oc2cc(F)cc(c2)S(C)(=O)=O)c1)C(F)(F)F
: