Target
5-hydroxytryptamine receptor 2A
Ligand
BDBM50307811
Substrate
Meas. Tech.
ChEMBL_612567 (CHEMBL1074221)
EC50
19±n/a nM
Citation
 Teegarden, BRLi, HJayakumar, HStrah-Pleynet, SDosa, PISelaya, SDKato, NElwell, KHDavidson, JCheng, KSaldana, HFrazer, JMWhelan, KFoster, JEspitia, SWebb, RRBeeley, NRThomsen, WMorairty, SRKilduff, TSAl-Shamma, HA Discovery of 1-[3-(4-bromo-2-methyl-2h-pyrazol-3-yl)-4-methoxyphenyl]-3-(2,4-difluorophenyl)urea (nelotanserin) and related 5-hydroxytryptamine2A inverse agonists for the treatment of insomnia. J Med Chem 53:1923-36 (2010)  
Target
Name:
5-hydroxytryptamine receptor 2A
Synonyms:
5-HT-2 5-HT2A 5-hydroxytryptamine receptor 2A (5HT-2A) 5HT2A_HUMAN HTR2A | Serotonin receptor 2A
Type:
undefined
Mol. Mass.:
52607.65
Organism:
Homo sapiens (Human)
Description:
P28223
Residue:
471
  
Inhibitor
Name:
BDBM50307811
Synonyms:
1-(3-(4-bromo-1-methyl-1H-pyrazol-5-yl)phenyl)-3-(4-chlorophenyl)urea | CHEMBL598808
Type:
Small organic molecule
Emp. Form.:
C17H14BrClN4O
Mol. Mass.:
405.676
SMILES:
Cn1ncc(Br)c1-c1cccc(NC(=O)Nc2ccc(Cl)cc2)c1
: